Target
Cyclin-dependent kinase 12
Ligand
BDBM478955
Substrate
Meas. Tech.
Biochemical Assay for CDK12 (IC50 Determination)
IC50
140±n/a nM
Citation
 Poddutoori, RSamajdar, SMukherjee, S Substituted pyrazole derivatives as selective CDK12/13 inhibitors US Patent  US10894786 Publication Date 1/19/2021 
Target
Name:
Cyclin-dependent kinase 12
Synonyms:
2.7.11.22 CDC2-related protein kinase 7 CDK12_HUMAN CRKRS Cell division cycle 2-related protein kinase 7 Cyclin-dependent kinase 12 hCDK12
Type:
PROTEIN
Mol. Mass.:
164218.64
Organism:
Homo sapiens
Description:
ChEMBL_117739
Residue:
1490
  
Inhibitor
Name:
BDBM478955
Synonyms:
N-(5-cyclopropy1-1H-pyrazol-3-yl)-2-(1'-methacryloyl-1',2',5',6'-tetrahydro- [2,3'-bipyridin]-5-yl)acetamide | US10894786, Comp. No 57
Type:
Small organic molecule
Emp. Form.:
C22H25N5O2
Mol. Mass.:
391.4662
SMILES:
CC(=C)C(=O)N1CCC=C(C1)c1ccc(CC(=O)Nc2cc([nH]n2)C2CC2)cn1
: