Target
Cyclin-dependent kinase 12
Ligand
BDBM478957
Substrate
Meas. Tech.
Biochemical Assay for CDK12 (IC50 Determination)
IC50
40.0±n/a nM
Citation
 Poddutoori, RSamajdar, SMukherjee, S Substituted pyrazole derivatives as selective CDK12/13 inhibitors US Patent  US10894786 Publication Date 1/19/2021 
Target
Name:
Cyclin-dependent kinase 12
Synonyms:
2.7.11.22 CDC2-related protein kinase 7 CDK12_HUMAN CRKRS Cell division cycle 2-related protein kinase 7 Cyclin-dependent kinase 12 hCDK12
Type:
PROTEIN
Mol. Mass.:
164218.64
Organism:
Homo sapiens
Description:
ChEMBL_117739
Residue:
1490
  
Inhibitor
Name:
BDBM478957
Synonyms:
2-(1'-acryloyl-1',2',3',6'-tetrahydro-[2,4'-bipyridin]-5-yl)-N-(5-cyclopropyl-1H- pyrazol-3-yl)acetamide | US10894786, Comp. No 59
Type:
Small organic molecule
Emp. Form.:
C21H23N5O2
Mol. Mass.:
377.4396
SMILES:
C=CC(=O)N1CCC(=CC1)c1ccc(CC(=O)Nc2cc([nH]n2)C2CC2)cn1
: