Target
Cyclin-dependent kinase 13
Ligand
BDBM478957
Substrate
Meas. Tech.
Biochemical Assay for CDK13
IC50
19.0±n/a nM
Citation
 Poddutoori, RSamajdar, SMukherjee, S Substituted pyrazole derivatives as selective CDK12/13 inhibitors US Patent  US10894786 Publication Date 1/19/2021 
Target
Name:
Cyclin-dependent kinase 13
Synonyms:
CDC2-related protein kinase 5 CDC2L5 CDK13_HUMAN Cell division cycle 2-like protein kinase 5 Cholinesterase-related cell division controller hCDK13
Type:
PROTEIN
Mol. Mass.:
165002.38
Organism:
Homo sapiens (Human)
Description:
ChEMBL_774241
Residue:
1512
  
Inhibitor
Name:
BDBM478957
Synonyms:
2-(1'-acryloyl-1',2',3',6'-tetrahydro-[2,4'-bipyridin]-5-yl)-N-(5-cyclopropyl-1H- pyrazol-3-yl)acetamide | US10894786, Comp. No 59
Type:
Small organic molecule
Emp. Form.:
C21H23N5O2
Mol. Mass.:
377.4396
SMILES:
C=CC(=O)N1CCC(=CC1)c1ccc(CC(=O)Nc2cc([nH]n2)C2CC2)cn1
: