Target
Cyclin-dependent kinase 12
Ligand
BDBM478958
Substrate
Meas. Tech.
Biochemical Assay for CDK12 (IC50 Determination)
IC50
12.0±n/a nM
Citation
 Poddutoori, RSamajdar, SMukherjee, S Substituted pyrazole derivatives as selective CDK12/13 inhibitors US Patent  US10894786 Publication Date 1/19/2021 
Target
Name:
Cyclin-dependent kinase 12
Synonyms:
2.7.11.22 CDC2-related protein kinase 7 CDK12_HUMAN CRKRS Cell division cycle 2-related protein kinase 7 Cyclin-dependent kinase 12 hCDK12
Type:
PROTEIN
Mol. Mass.:
164218.64
Organism:
Homo sapiens
Description:
ChEMBL_117739
Residue:
1490
  
Inhibitor
Name:
BDBM478958
Synonyms:
N-(5-cyclopropyl-1H-pyrazol-3-yl)-2-(6-(1-propioloyl-2,5-dihydro-1H-pyrrol-3- yl)pyridin-3-yl)acetamide | US10894786, Comp. No 60
Type:
Small organic molecule
Emp. Form.:
C20H19N5O2
Mol. Mass.:
361.3972
SMILES:
O=C(Cc1ccc(nc1)C1=CCN(C1)C(=O)C#C)Nc1cc([nH]n1)C1CC1
: