Target
Cyclin-dependent kinase 12
Ligand
BDBM479121
Substrate
Meas. Tech.
Protein kinase assay (Condition B: Thiol-free Conditions)
IC50
550±n/a nM
Citation
 Kanouni, TArnold, LDKaldor, SWMurphy, EATyhonas, J Inhibitors of cyclin-dependent kinases US Patent  US10894788 Publication Date 1/19/2021 
Target
Name:
Cyclin-dependent kinase 12
Synonyms:
2.7.11.22 CDC2-related protein kinase 7 CDK12_HUMAN CRKRS Cell division cycle 2-related protein kinase 7 Cyclin-dependent kinase 12 hCDK12
Type:
PROTEIN
Mol. Mass.:
164218.64
Organism:
Homo sapiens
Description:
ChEMBL_117739
Residue:
1490
  
Inhibitor
Name:
BDBM479121
Synonyms:
(R)-N-(4-(3-((5-bromopyrimidin-2- yl)amino)pyrrolidine-1-carbonyl)-2- (2-(4,4-difluoropiperidin-1- yl)ethoxy)phenyl)acrylamide US11390618, Example 162
Type:
Small organic molecule
Emp. Form.:
C25H29BrF2N6O3
Mol. Mass.:
579.437
SMILES:
FC1(F)CCN(CCOc2cc(ccc2NC(=O)C=C)C(=O)N2CC[C@H](C2)Nc2ncc(Br)cn2)CC1
: