Target
Orexin/Hypocretin receptor type 1
Ligand
BDBM479271
Substrate
Meas. Tech.
Orexin Receptor Cell-Based Functional Assay
IC50
5.00±n/a nM
Citation
 Kamenecka, TMHolenz, JWesolowski, SHe, YBürli, R Halo-substituted piperidines as orexin receptor modulators US Patent  US10894789 Publication Date 1/19/2021 
Target
Name:
Orexin/Hypocretin receptor type 1
Synonyms:
HCRTR1 OX1R_HUMAN Orexin receptor type 1 (OR 1) Orexin receptor type 1 (OX1) Orexin receptor type 1 (OxR1) | Ox1r
Type:
Protein
Mol. Mass.:
47554.50
Organism:
Homo sapiens (Human)
Description:
O43613
Residue:
425
  
Inhibitor
Name:
BDBM479271
Synonyms:
US10894789, Compound 215
Type:
Small organic molecule
Emp. Form.:
C24H22F5N5O2
Mol. Mass.:
507.4558
SMILES:
C[C@@H]1CC(F)(F)CN([C@@H]1COc1ccc(cn1)C(F)(F)F)C(=O)c1nc(C)ccc1-c1ncccn1
: