Target
Glutamate carboxypeptidase 2
Ligand
BDBM479421
Substrate
Meas. Tech.
Enzymatic Assay for In Vitro Evaluation of PSMA Inhibitors
Ki
3.10±n/a nM
Citation
 Wang, EKolb, HCSzardenings, AKLiu, CWalsh, JCChen, GSinha, AKasi, DYu, CGangadharmath, UBZhang, WZhao, TMocharla, VP PSMA imaging agents US Patent  US10894807 Publication Date 1/19/2021 
Target
Name:
Glutamate carboxypeptidase 2
Synonyms:
FGCP FOLH1 Folate hydrolase 1 Glutamate carboxypeptidase 2 Membrane glutamate carboxypeptidase NAALAD1 PSM Prostate-specific membrane antigen mGCP
Type:
PROTEIN
Mol. Mass.:
84333.66
Organism:
Homo sapiens (Human)
Description:
ChEMBL_1497035
Residue:
750
  
Inhibitor
Name:
BDBM479421
Synonyms:
US10894807, ID P212
Type:
Small organic molecule
Emp. Form.:
C27H30FN7O8
Mol. Mass.:
599.5676
SMILES:
OC(=O)CC[C@H](NC(=O)N[C@@H](Cc1ccc(NC(=O)Nc2ccc(cc2)-n2cc(CCCF)nn2)cc1)C(O)=O)C(O)=O
: