Target
Glutamate carboxypeptidase 2
Ligand
BDBM479443
Substrate
Meas. Tech.
Enzymatic Assay for In Vitro Evaluation of PSMA Inhibitors
Ki
94.0±n/a nM
Citation
 Wang, EKolb, HCSzardenings, AKLiu, CWalsh, JCChen, GSinha, AKasi, DYu, CGangadharmath, UBZhang, WZhao, TMocharla, VP PSMA imaging agents US Patent  US10894807 Publication Date 1/19/2021 
Target
Name:
Glutamate carboxypeptidase 2
Synonyms:
FGCP FOLH1 Folate hydrolase 1 Glutamate carboxypeptidase 2 Membrane glutamate carboxypeptidase NAALAD1 PSM Prostate-specific membrane antigen mGCP
Type:
PROTEIN
Mol. Mass.:
84333.66
Organism:
Homo sapiens (Human)
Description:
ChEMBL_1497035
Residue:
750
  
Inhibitor
Name:
BDBM479443
Synonyms:
US10894807, ID P252
Type:
Small organic molecule
Emp. Form.:
C37H46FN9O18
Mol. Mass.:
923.809
SMILES:
OC(=O)CCC(NC(=O)C[C@@H](NC(=O)CCNC(=O)c1cc(cc(c1)-n1cc(CCCF)nn1)C(=O)NCCC(=O)N[C@H](CC(=O)NC(CCC(O)=O)C(O)=O)C(O)=O)C(O)=O)C(O)=O
: