Target
Glutamate carboxypeptidase 2
Ligand
BDBM479448
Substrate
Meas. Tech.
Enzymatic Assay for In Vitro Evaluation of PSMA Inhibitors
Ki
1.30±n/a nM
Citation
 Wang, EKolb, HCSzardenings, AKLiu, CWalsh, JCChen, GSinha, AKasi, DYu, CGangadharmath, UBZhang, WZhao, TMocharla, VP PSMA imaging agents US Patent  US10894807 Publication Date 1/19/2021 
Target
Name:
Glutamate carboxypeptidase 2
Synonyms:
FGCP FOLH1 Folate hydrolase 1 Glutamate carboxypeptidase 2 Membrane glutamate carboxypeptidase NAALAD1 PSM Prostate-specific membrane antigen mGCP
Type:
PROTEIN
Mol. Mass.:
84333.66
Organism:
Homo sapiens (Human)
Description:
ChEMBL_1497035
Residue:
750
  
Inhibitor
Name:
BDBM479448
Synonyms:
US10894807, ID P263
Type:
Small organic molecule
Emp. Form.:
C47H66FN13O18
Mol. Mass.:
1120.1016
SMILES:
OC(=O)CCC(NC(=O)N[C@@H](CCCCNC(=O)N1CCN(CC1)C(=O)c1cc(cc(c1)-n1cc(CCCF)nn1)C(=O)N1CCN(CC1)C(=O)NCCCC[C@H](NC(=O)NC(CCC(O)=O)C(O)=O)C(O)=O)C(O)=O)C(O)=O
: