Target
Glutamate carboxypeptidase 2
Ligand
BDBM479465
Substrate
Meas. Tech.
Enzymatic Assay for In Vitro Evaluation of PSMA Inhibitors
Ki
12.5±n/a nM
Citation
 Wang, EKolb, HCSzardenings, AKLiu, CWalsh, JCChen, GSinha, AKasi, DYu, CGangadharmath, UBZhang, WZhao, TMocharla, VP PSMA imaging agents US Patent  US10894807 Publication Date 1/19/2021 
Target
Name:
Glutamate carboxypeptidase 2
Synonyms:
FGCP FOLH1 Folate hydrolase 1 Glutamate carboxypeptidase 2 Membrane glutamate carboxypeptidase NAALAD1 PSM Prostate-specific membrane antigen mGCP
Type:
PROTEIN
Mol. Mass.:
84333.66
Organism:
Homo sapiens (Human)
Description:
ChEMBL_1497035
Residue:
750
  
Inhibitor
Name:
BDBM479465
Synonyms:
US10894807, ID P286
Type:
Small organic molecule
Emp. Form.:
C45H56FN11O17
Mol. Mass.:
1041.988
SMILES:
OC(=O)CC[C@H](NC(=O)NC(CCCCNC(=O)c1cc(cc(c1)-n1cc(CCCF)nn1)C(=O)N1CCN(CC1)C(=O)Nc1ccc(C[C@H](NC(=O)N[C@H](CCC(O)=O)C(O)=O)C(O)=O)cc1)C(O)=O)C(O)=O
: