Target
Glutamate carboxypeptidase 2
Ligand
BDBM479466
Substrate
Meas. Tech.
Enzymatic Assay for In Vitro Evaluation of PSMA Inhibitors
Ki
1.000±n/a nM
Citation
 Wang, EKolb, HCSzardenings, AKLiu, CWalsh, JCChen, GSinha, AKasi, DYu, CGangadharmath, UBZhang, WZhao, TMocharla, VP PSMA imaging agents US Patent  US10894807 Publication Date 1/19/2021 
Target
Name:
Glutamate carboxypeptidase 2
Synonyms:
FGCP FOLH1 Folate hydrolase 1 Glutamate carboxypeptidase 2 Membrane glutamate carboxypeptidase NAALAD1 PSM Prostate-specific membrane antigen mGCP
Type:
PROTEIN
Mol. Mass.:
84333.66
Organism:
Homo sapiens (Human)
Description:
ChEMBL_1497035
Residue:
750
  
Inhibitor
Name:
BDBM479466
Synonyms:
US10894807, ID P287
Type:
Small organic molecule
Emp. Form.:
C58H84FN13O25
Mol. Mass.:
1382.3581
SMILES:
OC(=O)CCC(NC(=O)N[C@@H](CCCCNC(=O)CCC(CCC(=O)NCCCC[C@H](NC(=O)NC(CCC(O)=O)C(O)=O)C(O)=O)(CCC(=O)NCCCC[C@H](NC(=O)NC(CCC(O)=O)C(O)=O)C(O)=O)NC(=O)c1ccc(cc1)-n1cc(CCCF)nn1)C(O)=O)C(O)=O
: