Target
Adenosine receptor A2b
Ligand
BDBM479372
Substrate
Meas. Tech.
Binding Affinity Assay
IC50
1.40±n/a nM
Citation
 Qi, CTsui, HZeng, QYang, ZZhang, X Pyrazine compounds and uses thereof US Patent  US10898481 Publication Date 1/26/2021 
Target
Name:
Adenosine receptor A2b
Synonyms:
AA2BR_HUMAN ADORA2B Adenosine receptors A2b | Adenosine receptors; A2a & A2b
Type:
G Protein-Coupled Receptor (GPCR)
Mol. Mass.:
36341.22
Organism:
Homo sapiens (Human)
Description:
Residue:
332
  
Inhibitor
Name:
BDBM479372
Synonyms:
3-amino-N-(2,6-difluorobenzyl)-6-(1- methyl-6-oxo-1,6-dihydropyridin-3-yl)- 5-(oxazol-2-yl)pyrazine-2-carboxamide US11571420, Compound 3
Type:
Small organic molecule
Emp. Form.:
C21H16F2N6O3
Mol. Mass.:
438.3869
SMILES:
Cn1cc(ccc1=O)-c1nc(C(=O)NCc2c(F)cccc2F)c(N)nc1-c1ncco1
: