Target
Adenosine receptor A2a
Ligand
BDBM479512
Substrate
Meas. Tech.
Binding Affinity Assay
IC50
1.000±n/a nM
Citation
 Qi, CTsui, HZeng, QYang, ZZhang, X Pyrazine compounds and uses thereof US Patent  US10898481 Publication Date 1/26/2021 
Target
Name:
Adenosine receptor A2a
Synonyms:
A2A adenosine receptor (hA2A) ADENOSINE A2 ADORA2 Adenosine A2A receptor (A2AAR)
Type:
G Protein-Coupled Receptor (GPCR)
Mol. Mass.:
44716.46
Organism:
Homo sapiens (Human)
Description:
P29274
Residue:
412
  
Inhibitor
Name:
BDBM479512
Synonyms:
3-amino-N-(2,6-difluorobenzyl)-6-(1- methyl-6-oxo-1,6-dihydropyridazin-3- yl)-5-(oxazol-2-yl)pyrazine-2- carboxamide US11571420, Compound 37
Type:
Small organic molecule
Emp. Form.:
C20H15F2N7O3
Mol. Mass.:
439.375
SMILES:
Cn1nc(ccc1=O)-c1nc(C(=O)NCc2c(F)cccc2F)c(N)nc1-c1ncco1
: