Target
Adenosine receptor A1
Ligand
BDBM479518
Substrate
Meas. Tech.
Binding Affinity Assay
IC50
117±n/a nM
Citation
 Qi, CTsui, HZeng, QYang, ZZhang, X Pyrazine compounds and uses thereof US Patent  US10898481 Publication Date 1/26/2021 
Target
Name:
Adenosine receptor A1
Synonyms:
A1 adenosine receptor (hA1) AA1R_HUMAN ADORA1 Adenosine A1-receptor Adenosine receptor A1 (hA1) | Adenosine transporter (AdT)
Type:
G Protein-Coupled Receptor (GPCR)
Mol. Mass.:
36520.92
Organism:
Homo sapiens (Human)
Description:
P30542
Residue:
326
  
Inhibitor
Name:
BDBM479518
Synonyms:
3-amino-N-((6-amino-3-fluoropyridin- 2-yl)methyl)-6-(1-methyl-6-oxo-1,6-di- hydropyridin-3-yl)-5-(oxazol-2-yl) pyrazine-2-carboxamide US11571420, Compound 49
Type:
Small organic molecule
Emp. Form.:
C20H17FN8O3
Mol. Mass.:
436.3992
SMILES:
Cn1cc(ccc1=O)-c1nc(C(=O)NCc2nc(N)ccc2F)c(N)nc1-c1ncco1
: