Target
Adenosine receptor A1
Ligand
BDBM479519
Substrate
Meas. Tech.
Binding Affinity Assay
IC50
78.0±n/a nM
Citation
 Qi, CTsui, HZeng, QYang, ZZhang, X Pyrazine compounds and uses thereof US Patent  US10898481 Publication Date 1/26/2021 
Target
Name:
Adenosine receptor A1
Synonyms:
A1 adenosine receptor (hA1) AA1R_HUMAN ADORA1 Adenosine A1-receptor Adenosine receptor A1 (hA1) | Adenosine transporter (AdT)
Type:
G Protein-Coupled Receptor (GPCR)
Mol. Mass.:
36520.92
Organism:
Homo sapiens (Human)
Description:
P30542
Residue:
326
  
Inhibitor
Name:
BDBM479519
Synonyms:
3-amino-N-((3-fluoropyridin-2-yl) methyl)-6-(3-methyl-3H-benzo[d] imidazol- 5-yl)-5-(oxazol-2-yl)pyrazine-2- carboxamide US11571420, Compound 51
Type:
Small organic molecule
Emp. Form.:
C22H17FN8O2
Mol. Mass.:
444.4212
SMILES:
Cn1cnc2ccc(cc12)-c1nc(C(=O)NCc2ncccc2F)c(N)nc1-c1ncco1
: