Target
Adenosine receptor A2a
Ligand
BDBM479521
Substrate
Meas. Tech.
Binding Affinity Assay
IC50
13.0±n/a nM
Citation
 Qi, CTsui, HZeng, QYang, ZZhang, X Pyrazine compounds and uses thereof US Patent  US10898481 Publication Date 1/26/2021 
Target
Name:
Adenosine receptor A2a
Synonyms:
A2A adenosine receptor (hA2A) ADENOSINE A2 ADORA2 Adenosine A2A receptor (A2AAR)
Type:
G Protein-Coupled Receptor (GPCR)
Mol. Mass.:
44716.46
Organism:
Homo sapiens (Human)
Description:
P29274
Residue:
412
  
Inhibitor
Name:
BDBM479521
Synonyms:
3-amino-6-(2,6-dimethylpyridin-4-yl)- 5-(4-fluorophenyl)-N-(2- (trifluoromethoxy)benzyl)pyrazine- 2-carboxamide US11571420, Compound 65
Type:
Small organic molecule
Emp. Form.:
C26H21F4N5O2
Mol. Mass.:
511.4709
SMILES:
Cc1cc(cc(C)n1)-c1nc(C(=O)NCc2ccccc2OC(F)(F)F)c(N)nc1-c1ccc(F)cc1
: