Target
Adenosine receptor A2a
Ligand
BDBM479530
Substrate
Meas. Tech.
Binding Affinity Assay
IC50
1.40±n/a nM
Citation
 Qi, CTsui, HZeng, QYang, ZZhang, X Pyrazine compounds and uses thereof US Patent  US10898481 Publication Date 1/26/2021 
Target
Name:
Adenosine receptor A2a
Synonyms:
A2A adenosine receptor (hA2A) ADENOSINE A2 ADORA2 Adenosine A2A receptor (A2AAR)
Type:
G Protein-Coupled Receptor (GPCR)
Mol. Mass.:
44716.46
Organism:
Homo sapiens (Human)
Description:
P29274
Residue:
412
  
Inhibitor
Name:
BDBM479530
Synonyms:
(R)-3-amino-6-(3-methylimidazo[1,2-a] pyridin-6-yl)-5-(oxazol-2-yl)-N- ((tetrahydrofuran-2-yl)methyl)pyrazine- 2-carboxamide US11571420, Compound 126
Type:
Small organic molecule
Emp. Form.:
C21H21N7O3
Mol. Mass.:
419.4365
SMILES:
Cc1cnc2ccc(cn12)-c1nc(C(=O)NC[C@H]2CCCO2)c(N)nc1-c1ncco1
: