Target
Programmed cell death 1 ligand 1/2
Ligand
BDBM479846
Substrate
Meas. Tech.
Amplified Luminescent Proximity Homogeneous Assay
IC50
118±n/a nM
Citation
Target
Name:
Programmed cell death 1 ligand 1/2
Synonyms:
PD-1/PD-L1
Type:
Protein
Mol. Mass.:
Description:
Components:
This complex has 2 components.
Component 1
Name:
Programmed cell death 1 ligand 1
Synonyms:
B7 homolog 1 B7H1 CD274 PD-L1 PDCD1 ligand 1 PDCD1LG1 Programmed cell death 1 ligand 1 | Programmed death ligand 1
Type:
PROTEIN
Mol. Mass.:
33278.49
Organism:
Homo sapiens (Human)
Description:
ChEMBL_109807
Residue:
290
  
Component 2
Name:
Programmed cell death 1 ligand 2
Synonyms:
B7-DC Butyrophilin B7-DC CD_antigen=CD273 PD-L2 PDCD1 ligand 2 PDCD1LG2 Programmed cell death 1 ligand 2 | Programmed death ligand 2
Type:
PROTEIN
Mol. Mass.:
30963.56
Organism:
Homo sapiens
Description:
ChEMBL_114967
Residue:
273
  
Inhibitor
Name:
BDBM479846
Synonyms:
US10899735, No. 305
Type:
Small organic molecule
Emp. Form.:
C36H38Cl2N6O4
Mol. Mass.:
689.631
SMILES:
COc1nc(ccc1CNC[C@H]1CCC(=O)N1)-c1cccc(c1Cl)-c1cccc(c1Cl)-c1ccc(CNC[C@@H]2CCC(=O)N2)c(OC)n1
: