Target
Vascular endothelial growth factor receptor 2
Ligand
BDBM480001
Substrate
Meas. Tech.
Inhibition Assay
IC50
4200±n/a nM
Citation
 Yang, FZhang, LShen, GHe, FTao, W 3,4-bipyridyl pyrazole derivative, and preparation method therefor and medical application thereof US Patent  US10899741 Publication Date 1/26/2021 
Target
Name:
Vascular endothelial growth factor receptor 2
Synonyms:
CD_antigen=CD309 Fetal liver kinase 1 (FLK-1) KDR Protein-tyrosine kinase receptor Flk-1 VEGFR-2 VEGFR2 Vascular Endothelial Growth Factor Receptor Kinase 2 Vascular endothelial growth factor receptor 2 (KDR) Vascular endothelial growth factor receptor 2 (VEGFR2) Vascular endothelial growth factor receptor-2 (VEGFR-2)
Type:
Receptor Tyrosine Kinase
Mol. Mass.:
151510.97
Organism:
Homo sapiens (Human)
Description:
P35968
Residue:
1356
  
Inhibitor
Name:
BDBM480001
Synonyms:
4-(1-Cyclopropyl-3-(6-methylpyridin-2-yl)-1H-pyrazol-4-yl)-2-(4-(methylsulfonyl)phenyl)pyridine | US10899741, Example 2
Type:
Small organic molecule
Emp. Form.:
C24H22N4O2S
Mol. Mass.:
430.522
SMILES:
Cc1cccc(n1)-c1nn(cc1-c1ccnc(c1)-c1ccc(cc1)S(C)(=O)=O)C1CC1
: