Target
Mitogen-activated protein kinase 14
Ligand
BDBM480001
Substrate
Meas. Tech.
Inhibition Assay
IC50
1000±n/a nM
Citation
 Yang, FZhang, LShen, GHe, FTao, W 3,4-bipyridyl pyrazole derivative, and preparation method therefor and medical application thereof US Patent  US10899741 Publication Date 1/26/2021 
Target
Name:
Mitogen-activated protein kinase 14
Synonyms:
CSAID-binding protein CSBP1 CSPB1 MAP kinase 14 MAP kinase p38 alpha MAPK14 MK14_HUMAN Mitogen-activated protein kinase p38 alpha Stress-activated protein kinase 2a | p38 MAP kinase alpha/beta
Type:
Serine/threonine-protein kinase
Mol. Mass.:
41286.76
Organism:
Homo sapiens (Human)
Description:
Q16539
Residue:
360
  
Inhibitor
Name:
BDBM480001
Synonyms:
4-(1-Cyclopropyl-3-(6-methylpyridin-2-yl)-1H-pyrazol-4-yl)-2-(4-(methylsulfonyl)phenyl)pyridine | US10899741, Example 2
Type:
Small organic molecule
Emp. Form.:
C24H22N4O2S
Mol. Mass.:
430.522
SMILES:
Cc1cccc(n1)-c1nn(cc1-c1ccnc(c1)-c1ccc(cc1)S(C)(=O)=O)C1CC1
: