Target
Tyrosine-protein kinase BTK
Ligand
BDBM480096
Substrate
Meas. Tech.
In Vitro Kinase Assay
IC50
<1.000±n/a nM
Citation
 Hopkins, BTMa, BPrince, RMarx, ISchulz, JNevalainen, MDechantsreiter, M Inhibiting agents for Bruton's tyrosine kinase US Patent  US10899753 Publication Date 1/26/2021 
Target
Name:
Tyrosine-protein kinase BTK
Synonyms:
AGMX1 Agammaglobulinaemia tyrosine kinase B cell progenitor kinase BPK BTK_HUMAN Tyrosine Kinase BTK Tyrosine-protein kinase BTK (BTK)
Type:
Enzyme
Mol. Mass.:
76289.95
Organism:
Homo sapiens (Human)
Description:
Q06187
Residue:
659
  
Inhibitor
Name:
BDBM480096
Synonyms:
US10899753, Example 27
Type:
Small organic molecule
Emp. Form.:
C23H25F2N9O
Mol. Mass.:
481.5011
SMILES:
Cc1c(CNC(=O)c2nn(cc2F)C(C)(C)C)ccc(c1F)-c1ncnc(Nc2cnn(C)c2)n1
: