Target
Tyrosine-protein kinase BTK
Ligand
BDBM480379
Substrate
Meas. Tech.
In Vitro Kinase Assay
IC50
<1.000±n/a nM
Citation
 Hopkins, BTMa, BPrince, RMarx, ISchulz, JNevalainen, MDechantsreiter, M Inhibiting agents for Bruton's tyrosine kinase US Patent  US10899753 Publication Date 1/26/2021 
Target
Name:
Tyrosine-protein kinase BTK
Synonyms:
AGMX1 Agammaglobulinaemia tyrosine kinase B cell progenitor kinase BPK BTK_HUMAN Tyrosine Kinase BTK Tyrosine-protein kinase BTK (BTK)
Type:
Enzyme
Mol. Mass.:
76289.95
Organism:
Homo sapiens (Human)
Description:
Q06187
Residue:
659
  
Inhibitor
Name:
BDBM480379
Synonyms:
(R)-5-(1-fluoro-2-methylpropan-2-yl)-N-(2-(4-((1-methyl-1H-pyrazol-3-yl)amino)-1,3,5-triazin-2-yl)-6,7,8,9-tetrahydro-5H-benzo[7]annulen-5-yl)-1,2,4-oxadiazole-3-carboxamide | US10899753, Example 53
Type:
Small organic molecule
Emp. Form.:
C25H28FN9O2
Mol. Mass.:
505.5473
SMILES:
Cn1ccc(Nc2ncnc(n2)-c2ccc3[C@@H](CCCCc3c2)NC(=O)c2noc(n2)C(C)(C)CF)n1
: