Target
Tyrosine-protein kinase BTK
Ligand
BDBM480383
Substrate
Meas. Tech.
In Vitro Kinase Assay
IC50
<1.000±n/a nM
Citation
 Hopkins, BTMa, BPrince, RMarx, ISchulz, JNevalainen, MDechantsreiter, M Inhibiting agents for Bruton's tyrosine kinase US Patent  US10899753 Publication Date 1/26/2021 
Target
Name:
Tyrosine-protein kinase BTK
Synonyms:
AGMX1 Agammaglobulinaemia tyrosine kinase B cell progenitor kinase BPK BTK_HUMAN Tyrosine Kinase BTK Tyrosine-protein kinase BTK (BTK)
Type:
Enzyme
Mol. Mass.:
76289.95
Organism:
Homo sapiens (Human)
Description:
Q06187
Residue:
659
  
Inhibitor
Name:
BDBM480383
Synonyms:
3-(tert-butyl)-N-(5-fluoro-2-methyl-4-(4-((1-methyl-1H-pyrazol-4-yl)amino)-1,3,5-triazin-2-yl)benzyl)-1,2,4-oxadiazole-5-carboxamide | US10899753, Example 57
Type:
Small organic molecule
Emp. Form.:
C22H24FN9O2
Mol. Mass.:
465.4835
SMILES:
Cc1cc(c(F)cc1CNC(=O)c1nc(no1)C(C)(C)C)-c1ncnc(Nc2cnn(C)c2)n1
: