Target
Tyrosine-protein kinase BTK
Ligand
BDBM480407
Substrate
Meas. Tech.
In Vitro Kinase Assay
IC50
<1.000±n/a nM
Citation
 Hopkins, BTMa, BPrince, RMarx, ISchulz, JNevalainen, MDechantsreiter, M Inhibiting agents for Bruton's tyrosine kinase US Patent  US10899753 Publication Date 1/26/2021 
Target
Name:
Tyrosine-protein kinase BTK
Synonyms:
AGMX1 Agammaglobulinaemia tyrosine kinase B cell progenitor kinase BPK BTK_HUMAN Tyrosine Kinase BTK Tyrosine-protein kinase BTK (BTK)
Type:
Enzyme
Mol. Mass.:
76289.95
Organism:
Homo sapiens (Human)
Description:
Q06187
Residue:
659
  
Inhibitor
Name:
BDBM480407
Synonyms:
(R)-5-(tert-butyl)-N-(8-(4-((1-methyl-1H-pyrazol-4-yl)amino)-1,3,5-triazin-2-yl)-2-(2,2,2-trifluoroethyl)-2,3,4,5-tetrahydro-1H-benzo[c]azepin-5-yl)-1,2,4-oxadiazole-3-carboxamide | US10899753, Example 90
Type:
Small organic molecule
Emp. Form.:
C26H29F3N10O2
Mol. Mass.:
570.5695
SMILES:
Cn1cc(Nc2ncnc(n2)-c2ccc3[C@@H](CCN(CC(F)(F)F)Cc3c2)NC(=O)c2noc(n2)C(C)(C)C)cn1
: