Target
Tyrosine-protein kinase BTK
Ligand
BDBM480414
Substrate
Meas. Tech.
In Vitro Kinase Assay
IC50
<1.000±n/a nM
Citation
 Hopkins, BTMa, BPrince, RMarx, ISchulz, JNevalainen, MDechantsreiter, M Inhibiting agents for Bruton's tyrosine kinase US Patent  US10899753 Publication Date 1/26/2021 
Target
Name:
Tyrosine-protein kinase BTK
Synonyms:
AGMX1 Agammaglobulinaemia tyrosine kinase B cell progenitor kinase BPK BTK_HUMAN Tyrosine Kinase BTK Tyrosine-protein kinase BTK (BTK)
Type:
Enzyme
Mol. Mass.:
76289.95
Organism:
Homo sapiens (Human)
Description:
Q06187
Residue:
659
  
Inhibitor
Name:
BDBM480414
Synonyms:
2-(tert-butyl)-N-(3-fluoro-2-methyl-4-(4-((1-methyl-1H-pyrazol-3-yl)amino)-1,3,5-triazin-2-yl)benzyl)oxazole-4-carboxamide | US10899753, Example 100
Type:
Small organic molecule
Emp. Form.:
C23H25FN8O2
Mol. Mass.:
464.4954
SMILES:
Cc1c(CNC(=O)c2coc(n2)C(C)(C)C)ccc(c1F)-c1ncnc(Nc2ccn(C)n2)n1
: