Target
Tyrosine-protein kinase BTK
Ligand
BDBM480438
Substrate
Meas. Tech.
In Vitro Kinase Assay
IC50
5.50±n/a nM
Citation
 Hopkins, BTMa, BPrince, RMarx, ISchulz, JNevalainen, MDechantsreiter, M Inhibiting agents for Bruton's tyrosine kinase US Patent  US10899753 Publication Date 1/26/2021 
Target
Name:
Tyrosine-protein kinase BTK
Synonyms:
AGMX1 Agammaglobulinaemia tyrosine kinase B cell progenitor kinase BPK BTK_HUMAN Tyrosine Kinase BTK Tyrosine-protein kinase BTK (BTK)
Type:
Enzyme
Mol. Mass.:
76289.95
Organism:
Homo sapiens (Human)
Description:
Q06187
Residue:
659
  
Inhibitor
Name:
BDBM480438
Synonyms:
US10899753, Example 52
Type:
Small organic molecule
Emp. Form.:
C22H19F4N9O2
Mol. Mass.:
517.439
SMILES:
Cc1c(CNC(=O)c2noc(n2)C2(CC2)C(F)(F)F)ccc(c1F)-c1ncnc(Nc2ccn(C)n2)n1
: