Target
Tyrosine-protein kinase BTK
Ligand
BDBM480445
Substrate
Meas. Tech.
In Vitro Kinase Assay
IC50
5.50±n/a nM
Citation
 Hopkins, BTMa, BPrince, RMarx, ISchulz, JNevalainen, MDechantsreiter, M Inhibiting agents for Bruton's tyrosine kinase US Patent  US10899753 Publication Date 1/26/2021 
Target
Name:
Tyrosine-protein kinase BTK
Synonyms:
AGMX1 Agammaglobulinaemia tyrosine kinase B cell progenitor kinase BPK BTK_HUMAN Tyrosine Kinase BTK Tyrosine-protein kinase BTK (BTK)
Type:
Enzyme
Mol. Mass.:
76289.95
Organism:
Homo sapiens (Human)
Description:
Q06187
Residue:
659
  
Inhibitor
Name:
BDBM480445
Synonyms:
(R)-5-(tert-butyl)-N-(1-(2-(difluoromethyl)-3-fluoro-4-(4-((1-methyl-1H-pyrazol-3-yl)amino)-1,3,5-triazin-2-yl)phenyl)ethyl)-1,2,4-oxadiazole-3-carboxamide | US10899753, Example 82
Type:
Small organic molecule
Emp. Form.:
C23H24F3N9O2
Mol. Mass.:
515.491
SMILES:
C[C@@H](NC(=O)c1noc(n1)C(C)(C)C)c1ccc(c(F)c1C(F)F)-c1ncnc(Nc2ccn(C)n2)n1
: