Target
Dual specificity calcium/calmodulin-dependent 3',5'-cyclic nucleotide phosphodiesterase 1C
Ligand
BDBM474123
Substrate
Meas. Tech.
Inhibition Assay
IC50
12.0±n/a nM
Citation
 Kehler, JRasmussen, LKLanggård, MJessing, MVital, PJJuhl, K Combinations comprising substituted imidazo[1,5-α]pyrazinones as PDE1 inhibitors US Patent  US10905688 Publication Date 2/2/2021 
Target
Name:
Dual specificity calcium/calmodulin-dependent 3',5'-cyclic nucleotide phosphodiesterase 1C
Synonyms:
3',5'-cyclic-AMP phosphodiesterase Calcium/calmodulin-dependent 3',5'-cyclic nucleotide phosphodiesterase 1C Hcam3 PDE1C_HUMAN Phosphodiesterase 1C | Phosphodiesterase, PDE1/PDE5
Type:
Enzyme
Mol. Mass.:
80778.58
Organism:
Homo sapiens (Human)
Description:
Q14123
Residue:
709
  
Inhibitor
Name:
BDBM474123
Synonyms:
7-Benzyl-6-methyl-3-(tetrahydro- 2H-pyran-4-yl)imidazo[1,5- a]pyrazin-8(7H)-one US10912773, Example 16 | US11472810, Example 16
Type:
Small organic molecule
Emp. Form.:
C19H21N3O2
Mol. Mass.:
323.3889
SMILES:
Cc1cn2c(ncc2c(=O)n1Cc1ccccc1)C1CCOCC1
: