Target
Dual specificity calcium/calmodulin-dependent 3',5'-cyclic nucleotide phosphodiesterase 1B
Ligand
BDBM474167
Substrate
Meas. Tech.
Inhibition Assay
IC50
16.0±n/a nM
Citation
 Kehler, JRasmussen, LKLanggård, MJessing, MVital, PJJuhl, K Combinations comprising substituted imidazo[1,5-α]pyrazinones as PDE1 inhibitors US Patent  US10905688 Publication Date 2/2/2021 
Target
Name:
Dual specificity calcium/calmodulin-dependent 3',5'-cyclic nucleotide phosphodiesterase 1B
Synonyms:
63 kDa Cam-PDE Calcium/calmodulin-dependent 3',5'-cyclic nucleotide phosphodiesterase 1B PDE1B PDE1B_HUMAN Phosphodiesterase 1B Phosphodiesterase Type 1 (PDE1B) | Phosphodiesterase, PDE1/PDE5
Type:
Enzyme
Mol. Mass.:
61366.51
Organism:
Homo sapiens (Human)
Description:
Residue:
536
  
Inhibitor
Name:
BDBM474167
Synonyms:
7-(benzo[d][1,3]dioxol-5- ylmethyl)-6-methyl-3-(tetrahydro- 2H-pyran-4-yl)imidazo[1,5- a]pyrazin-8(7H)-one US10912773, Example 50 | US11472810, Example 50
Type:
Small organic molecule
Emp. Form.:
C20H21N3O4
Mol. Mass.:
367.3984
SMILES:
Cc1cn2c(ncc2c(=O)n1Cc1ccc2OCOc2c1)C1CCOCC1
: