Target
Dual specificity calcium/calmodulin-dependent 3',5'-cyclic nucleotide phosphodiesterase 1C
Ligand
BDBM474184
Substrate
Meas. Tech.
Inhibition Assay
IC50
5.00±n/a nM
Citation
 Kehler, JRasmussen, LKLanggård, MJessing, MVital, PJJuhl, K Combinations comprising substituted imidazo[1,5-α]pyrazinones as PDE1 inhibitors US Patent  US10905688 Publication Date 2/2/2021 
Target
Name:
Dual specificity calcium/calmodulin-dependent 3',5'-cyclic nucleotide phosphodiesterase 1C
Synonyms:
3',5'-cyclic-AMP phosphodiesterase Calcium/calmodulin-dependent 3',5'-cyclic nucleotide phosphodiesterase 1C Hcam3 PDE1C_HUMAN Phosphodiesterase 1C | Phosphodiesterase, PDE1/PDE5
Type:
Enzyme
Mol. Mass.:
80778.58
Organism:
Homo sapiens (Human)
Description:
Q14123
Residue:
709
  
Inhibitor
Name:
BDBM474184
Synonyms:
7-(cycloheptylmethyl)-6-methyl-3- (tetrahydro-2H-pyran-4- yl)imidazo[1,5-a]pyrazin-8(7H)- one US10912773, Example 65 | US11472810, Example 65
Type:
Small organic molecule
Emp. Form.:
C20H29N3O2
Mol. Mass.:
343.4632
SMILES:
Cc1cn2c(ncc2c(=O)n1CC1CCCCCC1)C1CCOCC1
: