Target
Pantetheinase
Ligand
BDBM480917
Substrate
Meas. Tech.
Enzyme Assay
IC50
<0.094±n/a nM
Citation
 Casimiro-Garcia, AStrohbach, JWHepworth, DLovering, FEChoi, CAllais, CPWright, SW Pyrimidine carboxamides as inhibitors of Vanin-1 enzyme US Patent  US10906888 Publication Date 2/2/2021 
Target
Name:
Pantetheinase
Synonyms:
Pantetheine hydrolase VNN1 Vanin-1 | Vascular non-inflammatory molecule 1
Type:
Enzyme Catalytic Domain
Mol. Mass.:
57002.46
Organism:
Homo sapiens (Human)
Description:
O95497
Residue:
513
  
Inhibitor
Name:
BDBM480917
Synonyms:
7-oxa-2-azaspiro[3.5]non-2-yl(2-{[2-(pyrazin-2-yl)propan-2-yl]amino}pyrimidin-5-yl)methanone | US10906888, Example 131
Type:
Small organic molecule
Emp. Form.:
C19H24N6O2
Mol. Mass.:
368.4329
SMILES:
CC(C)(Nc1ncc(cn1)C(=O)N1CC2(C1)CCOCC2)c1cnccn1
: