Target
Pantetheinase
Ligand
BDBM480929
Substrate
Meas. Tech.
Enzyme Assay
IC50
0.082±n/a nM
Citation
 Casimiro-Garcia, AStrohbach, JWHepworth, DLovering, FEChoi, CAllais, CPWright, SW Pyrimidine carboxamides as inhibitors of Vanin-1 enzyme US Patent  US10906888 Publication Date 2/2/2021 
Target
Name:
Pantetheinase
Synonyms:
Pantetheine hydrolase VNN1 Vanin-1 | Vascular non-inflammatory molecule 1
Type:
Enzyme Catalytic Domain
Mol. Mass.:
57002.46
Organism:
Homo sapiens (Human)
Description:
O95497
Residue:
513
  
Inhibitor
Name:
BDBM480929
Synonyms:
8-oxa-2-azaspiro[4.5]dec-2-yl(2-{[2-(pyrimidin-5-yl)propan-2-yl]amino}pyrimidin-5-yl)methanone | US10906888, Example 143
Type:
Small organic molecule
Emp. Form.:
C20H26N6O2
Mol. Mass.:
382.4594
SMILES:
CC(C)(Nc1ncc(cn1)C(=O)N1CCC2(C1)CCOCC2)c1cncnc1
: