Target
Apelin receptor
Ligand
BDBM480994
Substrate
Meas. Tech.
[35S]GTPγS Binding Assay
EC50
5.30±n/a nM
Citation
 Chen, NChen, YDebenedetto, MVDransfield, PJHarvey, JSHeath, JAHouze, JKhakoo, AYLai, SMa, ZNishimura, NPattaropong, VSwaminath, GYeh, WKreiman, C Triazole phenyl compounds as agonists of the APJ receptor US Patent  US10906890 Publication Date 2/2/2021 
Target
Name:
Apelin receptor
Synonyms:
AGTRL1 APJ_HUMAN Angiotensin receptor-like 1 Apelin receptor (APJ) G-protein coupled receptor HG11
Type:
Enzyme Catalytic Domain
Mol. Mass.:
42664.06
Organism:
Homo sapiens (Human)
Description:
P35414
Residue:
380
  
Inhibitor
Name:
BDBM480994
Synonyms:
US10906890, Example 3.0
Type:
Small organic molecule
Emp. Form.:
C23H25ClN8O5S
Mol. Mass.:
561.013
SMILES:
CO[C@@H]([C@H](C)S(=O)(=O)Nc1nnc(-c2cccc(Cl)c2)n1-c1c(OC)ncnc1OC)c1ncc(C)cn1
: