Target
Apelin receptor
Ligand
BDBM481013
Substrate
Meas. Tech.
[35S]GTPγS Binding Assay
EC50
170±n/a nM
Citation
 Chen, NChen, YDebenedetto, MVDransfield, PJHarvey, JSHeath, JAHouze, JKhakoo, AYLai, SMa, ZNishimura, NPattaropong, VSwaminath, GYeh, WKreiman, C Triazole phenyl compounds as agonists of the APJ receptor US Patent  US10906890 Publication Date 2/2/2021 
Target
Name:
Apelin receptor
Synonyms:
AGTRL1 APJ_HUMAN Angiotensin receptor-like 1 Apelin receptor (APJ) G-protein coupled receptor HG11
Type:
Enzyme Catalytic Domain
Mol. Mass.:
42664.06
Organism:
Homo sapiens (Human)
Description:
P35414
Residue:
380
  
Inhibitor
Name:
BDBM481013
Synonyms:
US10906890, Example 22.0
Type:
Small organic molecule
Emp. Form.:
C25H26FN7O4S
Mol. Mass.:
539.582
SMILES:
COc1cccc(OC)c1-n1c(NS(=O)(=O)[C@@H]2CCCN(C2)c2ncc(F)cn2)nnc1-c1ccccc1
: