Target
Apelin receptor
Ligand
BDBM481063
Substrate
Meas. Tech.
[35S]GTPγS Binding Assay
EC50
13.0±n/a nM
Citation
 Chen, NChen, YDebenedetto, MVDransfield, PJHarvey, JSHeath, JAHouze, JKhakoo, AYLai, SMa, ZNishimura, NPattaropong, VSwaminath, GYeh, WKreiman, C Triazole phenyl compounds as agonists of the APJ receptor US Patent  US10906890 Publication Date 2/2/2021 
Target
Name:
Apelin receptor
Synonyms:
AGTRL1 APJ_HUMAN Angiotensin receptor-like 1 Apelin receptor (APJ) G-protein coupled receptor HG11
Type:
Enzyme Catalytic Domain
Mol. Mass.:
42664.06
Organism:
Homo sapiens (Human)
Description:
P35414
Residue:
380
  
Inhibitor
Name:
BDBM481063
Synonyms:
US10906890, Example 75.0
Type:
Small organic molecule
Emp. Form.:
C27H29N7O6S
Mol. Mass.:
579.627
SMILES:
CO[C@@H]([C@H](C)S(=O)(=O)Nc1nnc(-c2ccc(OC)c(c2)C#N)n1-c1c(OC)cccc1OC)c1ncc(C)cn1
: