Target
Tyrosine-protein kinase ABL1
Ligand
BDBM481112
Substrate
Meas. Tech.
Kinase Assay
IC50
91.1±n/a nM
Citation
 Werner, MHKelly, TA Compositions and methods for inhibiting kinases US Patent  US10906896 Publication Date 2/2/2021 
Target
Name:
Tyrosine-protein kinase ABL1
Synonyms:
ABL ABL1_HUMAN JTK7 Proto-oncogene tyrosine-protein kinase ABL1 Tyrosine-protein kinase ABL V-abl Abelson murine leukemia viral oncogene homolog 1 p150 | tyrosine-protein kinase ABL1 isoform a
Type:
Enzyme
Mol. Mass.:
122897.30
Organism:
Homo sapiens (Human)
Description:
P00519
Residue:
1130
  
Inhibitor
Name:
BDBM481112
Synonyms:
US10906896, Cpd 116
Type:
Small organic molecule
Emp. Form.:
C38H39N13O3
Mol. Mass.:
725.8016
SMILES:
CNC(=O)c1cc(NC(=O)C2=NN=C(C2)c2cncc(c2)-c2ccnc(Nc3cc(NC(=O)c4ccc(CN5CCN(C)CC5)cc4)ccc3C)n2)[nH]n1
: