Target
Tyrosine-protein kinase ABL2
Ligand
BDBM481118
Substrate
Meas. Tech.
Kinase Assay
IC50
712±n/a nM
Citation
 Werner, MHKelly, TA Compositions and methods for inhibiting kinases US Patent  US10906896 Publication Date 2/2/2021 
Target
Name:
Tyrosine-protein kinase ABL2
Synonyms:
ABL2 ABLL Abelson murine leukemia viral oncogene homolog 2 Tyrosine kinase ARG | VHL/Tyrosine-protein kinase ABL2
Type:
PROTEIN
Mol. Mass.:
128360.63
Organism:
Homo sapiens (Human)
Description:
ChEMBL_325082
Residue:
1182
  
Inhibitor
Name:
BDBM481118
Synonyms:
US10906896, Cpd 203
Type:
Small organic molecule
Emp. Form.:
C37H36N12O4
Mol. Mass.:
712.7597
SMILES:
CN1CCN(Cc2ccc(cc2)C(=O)Nc2ccc(C)c(Nc3nccc(n3)-c3cncc(c3)C3=NN=C(C3)C(=O)Nc3nc(co3)C(N)=O)c2)CC1
: