Target
Mast/stem cell growth factor receptor Kit
Ligand
BDBM481119
Substrate
Meas. Tech.
Kinase Assay
Ki
12.2±n/a nM
Citation
 Werner, MHKelly, TA Compositions and methods for inhibiting kinases US Patent  US10906896 Publication Date 2/2/2021 
Target
Name:
Mast/stem cell growth factor receptor Kit
Synonyms:
CD117 antigen KIT Mast/stem cell growth factor receptor Kit (cKIT) Proto-oncogene tyrosine-protein kinase Kit Stem cell growth factor receptor Tyrosine-protein kinase Kit c-kit v-kit Hardy-Zuckerman 4 feline sarcoma viral oncogene homolog
Type:
Protein
Mol. Mass.:
109869.37
Organism:
Homo sapiens (Human)
Description:
P10721
Residue:
976
  
Inhibitor
Name:
BDBM481119
Synonyms:
US10906896, Cpd 207
Type:
Small organic molecule
Emp. Form.:
C37H37N11O3
Mol. Mass.:
683.7616
SMILES:
CN1CCN(Cc2ccc(cc2)C(=O)Nc2ccc(C)c(Nc3nccc(n3)-c3cncc(c3)C3=NN=C(C3)C(=O)Nc3cc(C)no3)c2)CC1
: