Target
Mast/stem cell growth factor receptor Kit
Ligand
BDBM481127
Substrate
Meas. Tech.
Kinase Assay
Ki
13.0±n/a nM
Citation
 Werner, MHKelly, TA Compositions and methods for inhibiting kinases US Patent  US10906896 Publication Date 2/2/2021 
Target
Name:
Mast/stem cell growth factor receptor Kit
Synonyms:
CD117 antigen KIT Mast/stem cell growth factor receptor Kit (cKIT) Proto-oncogene tyrosine-protein kinase Kit Stem cell growth factor receptor Tyrosine-protein kinase Kit c-kit v-kit Hardy-Zuckerman 4 feline sarcoma viral oncogene homolog
Type:
Protein
Mol. Mass.:
109869.37
Organism:
Homo sapiens (Human)
Description:
P10721
Residue:
976
  
Inhibitor
Name:
BDBM481127
Synonyms:
US10906896, Cpd 806 | US11725005, Compound 806
Type:
Small organic molecule
Emp. Form.:
C32H32N8O2
Mol. Mass.:
560.6489
SMILES:
Cc1cc(on1)-c1cncc(c1)-c1ccnc(Nc2cc(NC(=O)c3ccc(CN4CCNCC4)cc3)ccc2C)n1
: