Target
Tyrosine-protein kinase ABL2
Ligand
BDBM481135
Substrate
Meas. Tech.
Kinase Assay
IC50
182±n/a nM
Citation
 Werner, MHKelly, TA Compositions and methods for inhibiting kinases US Patent  US10906896 Publication Date 2/2/2021 
Target
Name:
Tyrosine-protein kinase ABL2
Synonyms:
ABL2 ABLL Abelson murine leukemia viral oncogene homolog 2 Tyrosine kinase ARG | VHL/Tyrosine-protein kinase ABL2
Type:
PROTEIN
Mol. Mass.:
128360.63
Organism:
Homo sapiens (Human)
Description:
ChEMBL_325082
Residue:
1182
  
Inhibitor
Name:
BDBM481135
Synonyms:
BDBM481139 US11725005, Compound 8170
Type:
Small organic molecule
Emp. Form.:
C32H32N8OS
Mol. Mass.:
576.714
SMILES:
CN1CCN(Cc2ccc(cc2)C(=O)Nc2ccc(C)c(Nc3nccc(n3)-c3cncc(c3)-c3ccns3)c2)CC1
: