Target
Tyrosine-protein kinase ABL2
Ligand
BDBM481137
Substrate
Meas. Tech.
Kinase Assay
IC50
91.0±n/a nM
Citation
 Werner, MHKelly, TA Compositions and methods for inhibiting kinases US Patent  US10906896 Publication Date 2/2/2021 
Target
Name:
Tyrosine-protein kinase ABL2
Synonyms:
ABL2 ABLL Abelson murine leukemia viral oncogene homolog 2 Tyrosine kinase ARG | VHL/Tyrosine-protein kinase ABL2
Type:
PROTEIN
Mol. Mass.:
128360.63
Organism:
Homo sapiens (Human)
Description:
ChEMBL_325082
Residue:
1182
  
Inhibitor
Name:
BDBM481137
Synonyms:
US10906896, Cpd 8190 | US11725005, Compound 8190
Type:
Small organic molecule
Emp. Form.:
C33H34N8OS
Mol. Mass.:
590.741
SMILES:
CN1CCN(Cc2ccc(cc2)C(=O)Nc2ccc(C)c(Nc3nccc(n3)-c3cncc(c3)-c3cc(C)ns3)c2)CC1
: