Target
Tyrosine-protein kinase ABL1
Ligand
BDBM481144
Substrate
Meas. Tech.
Kinase Assay
IC50
57.0±n/a nM
Citation
 Werner, MHKelly, TA Compositions and methods for inhibiting kinases US Patent  US10906896 Publication Date 2/2/2021 
Target
Name:
Tyrosine-protein kinase ABL1
Synonyms:
ABL ABL1_HUMAN JTK7 Proto-oncogene tyrosine-protein kinase ABL1 Tyrosine-protein kinase ABL V-abl Abelson murine leukemia viral oncogene homolog 1 p150 | tyrosine-protein kinase ABL1 isoform a
Type:
Enzyme
Mol. Mass.:
122897.30
Organism:
Homo sapiens (Human)
Description:
P00519
Residue:
1130
  
Inhibitor
Name:
BDBM481144
Synonyms:
US10906896, Cpd 8280 | US11725005, Compound 8280
Type:
Small organic molecule
Emp. Form.:
C33H34N8OS
Mol. Mass.:
590.741
SMILES:
CN1CCN(Cc2ccc(cc2)C(=O)Nc2ccc(C)c(Nc3nccc(n3)-c3cncc(c3)-c3ncc(C)s3)c2)CC1
: