Target
Programmed cell death 1 ligand 1 [19-238]/protein 1 [25-167]
Ligand
BDBM438809
Substrate
Meas. Tech.
Homogeneous Time-Resolved Fluorescence (HTRF) Binding Assay
IC50
<5±n/a nM
Citation
 Wu, LXiao, KYao, W Heterocyclic compounds as immunomodulators US Patent  US10906920 Publication Date 2/2/2021 
Target
Name:
Programmed cell death 1 ligand 1 [19-238]/protein 1 [25-167]
Synonyms:
PD-1/PD-L1
Type:
Protein
Mol. Mass.:
Description:
Components:
This complex has 2 components.
Component 1
Name:
Programmed cell death protein 1 [25-167]
Synonyms:
PD1 PDCD1_HUMAN Programmed cell death protein 1 (aa25-167) hPD-1
Type:
Enzyme Catalytic Domain
Mol. Mass.:
15954.64
Organism:
Homo sapiens (Human)
Description:
Q15116 (aa25-167)
Residue:
143
  
Component 2
Name:
Programmed cell death 1 ligand 1 [19-238]
Synonyms:
B7H1 PD-L1 PDCD1 ligand 1 PDCD1LG1 Programmed cell death 1 ligand 1 (aa19-238) hPD-L1
Type:
Enzyme Catalytic Domain
Mol. Mass.:
25191.31
Organism:
Homo sapiens (Human)
Description:
Q9NZQ7 (aa19-238)
Residue:
220
  
Inhibitor
Name:
BDBM438809
Synonyms:
4-((2-((3′-(5-(2-(4-carboxybicyclo[2.2.1]heptan-1-yl)ethyl)-1-methyl-4,5,6,7-tetrahydro-1H-imidazo[4,5-c]pyridine-2-carboxamido)-2-chloro-2′-methyl-[1,1′-biphenyl]-3-yl)carbamoyl)-1-methyl-1,4,6,7-tetrahydro-5H-imidazo[4,5-c]pyridin-5-yl)methyl)bicyclo[2.2.1]heptane-1-carboxylic acid US10906920, Example 44 | US11414433, Example 44
Type:
Small organic molecule
Emp. Form.:
C48H57ClN8O6
Mol. Mass.:
877.469
SMILES:
Cc1c(NC(=O)c2nc3CN(CCC45CCC(CC4)(C5)C(O)=O)CCc3n2C)cccc1-c1cccc(NC(=O)c2nc3CN(CC45CCC(CC4)(C5)C(O)=O)CCc3n2C)c1Cl
: