Target
Dual specificity calcium/calmodulin-dependent 3',5'-cyclic nucleotide phosphodiesterase 1C
Ligand
BDBM480842
Substrate
Meas. Tech.
Inhibition Assay
IC50
8.00±n/a nM
Citation
 Kehler, JRasmussen, LKLanggård, MJessing, MVital, PJJuhl, K Combinations comprising substituted imidazo[1,5-a]pyrazinones as PDE1 inhibitors US Patent  US10912773 Publication Date 2/9/2021 
Target
Name:
Dual specificity calcium/calmodulin-dependent 3',5'-cyclic nucleotide phosphodiesterase 1C
Synonyms:
3',5'-cyclic-AMP phosphodiesterase Calcium/calmodulin-dependent 3',5'-cyclic nucleotide phosphodiesterase 1C Hcam3 PDE1C_HUMAN Phosphodiesterase 1C | Phosphodiesterase, PDE1/PDE5
Type:
Enzyme
Mol. Mass.:
80778.58
Organism:
Homo sapiens (Human)
Description:
Q14123
Residue:
709
  
Inhibitor
Name:
BDBM480842
Synonyms:
7-(4-methoxybenzyl)-6-methyl-3- yl)imidazo[1,5-a]pyrazin-8(7H)- one, stereoisomer 3 US11472810, Example 55, isomer 3
Type:
Small organic molecule
Emp. Form.:
C20H23N3O3
Mol. Mass.:
353.4149
SMILES:
COc1ccc(Cn2c(C)cn3c(ncc3c2=O)[C@H]2CCO[C@@H]2C)cc1
: