Target
Fibroblast growth factor receptor 4
Ligand
BDBM249417
Substrate
Meas. Tech.
Inhibition Activity Assay
IC50
<1.000±n/a nM
Citation
 Reynolds, DHao, MWang, JPrajapati, SSatoh, TSelvaraj, A Pyrimidine FGFR4 inhibitors US Patent  US10912774 Publication Date 2/9/2021 
Target
Name:
Fibroblast growth factor receptor 4
Synonyms:
CD_antigen: CD334 FGFR4 FGFR4 Fibroblast growth factor receptor JK2 TKF
Type:
Protein
Mol. Mass.:
87957.45
Organism:
Homo sapiens (Human)
Description:
P22455
Residue:
802
  
Inhibitor
Name:
BDBM249417
Synonyms:
US10537571, Compound 135 US9434697, 135 | US9730931, Compound 135
Type:
Small organic molecule
Emp. Form.:
C30H36Cl2N8O4
Mol. Mass.:
643.564
SMILES:
CCN1CCN(Cc2ccc(Nc3cc(ncn3)N(C)C(=O)Nc3c(Cl)c(OC)cc(OC)c3Cl)c(NC(=O)C=C)c2)CC1
: