Target
Fibroblast growth factor receptor 4
Ligand
BDBM249431
Substrate
Meas. Tech.
Inhibition Activity Assay
IC50
<1.000±n/a nM
Citation
 Reynolds, DHao, MWang, JPrajapati, SSatoh, TSelvaraj, A Pyrimidine FGFR4 inhibitors US Patent  US10912774 Publication Date 2/9/2021 
Target
Name:
Fibroblast growth factor receptor 4
Synonyms:
CD_antigen: CD334 FGFR4 FGFR4 Fibroblast growth factor receptor JK2 TKF
Type:
Protein
Mol. Mass.:
87957.45
Organism:
Homo sapiens (Human)
Description:
P22455
Residue:
802
  
Inhibitor
Name:
BDBM249431
Synonyms:
US10537571, Compound 151 US9434697, 151 | US9730931, Compound 151
Type:
Small organic molecule
Emp. Form.:
C30H36Cl2N8O4
Mol. Mass.:
643.564
SMILES:
COc1cc(OC)c(Cl)c(NC(=O)N(C)c2cc(Nc3ccc(cc3NC(=O)C=C)N3CCN(CC3)C(C)C)ncn2)c1Cl
: