Target
Protein O-GlcNAcase
Ligand
BDBM481697
Substrate
Meas. Tech.
Assay for Determination of KI Values for Inhibition of O-GlcNAcase Activity
Ki
0.387±n/a nM
Citation
 McEachern, EJSelnick, HGZhou, Y Substituted piperidines thiazolyl acetamides as glycosidase inhibitors and uses thereof US Patent  US10913733 Publication Date 2/9/2021 
Target
Name:
Protein O-GlcNAcase
Synonyms:
2-acetamido-2-deoxy-β-D-glucopyranosidase (O-GlcNAcase) Beta-hexosaminidase (O-GlcNAcase) HEXC MEA5 N-acetyl-beta-D-glucosaminidase (O-GlcNAcase) OGA Protein O-GlcNAcase
Type:
Enzyme
Mol. Mass.:
102874.67
Organism:
Homo sapiens (Human)
Description:
O60502
Residue:
916
  
Inhibitor
Name:
BDBM481697
Synonyms:
N-(5-((4-((1H-pyrazol-4- yl)methylene)piperidin-1- yl)methyl)thiazol-2- yl)acetamide | US10913733, Example 8
Type:
Small organic molecule
Emp. Form.:
C15H19N5OS
Mol. Mass.:
317.409
SMILES:
CC(=O)Nc1ncc(CN2CCC(CC2)=Cc2cn[nH]c2)s1
: