Target
Protein O-GlcNAcase
Ligand
BDBM481718
Substrate
Meas. Tech.
Assay for Determination of KI Values for Inhibition of O-GlcNAcase Activity
Ki
0.324±n/a nM
Citation
 McEachern, EJSelnick, HGZhou, Y Substituted piperidines thiazolyl acetamides as glycosidase inhibitors and uses thereof US Patent  US10913733 Publication Date 2/9/2021 
Target
Name:
Protein O-GlcNAcase
Synonyms:
2-acetamido-2-deoxy-β-D-glucopyranosidase (O-GlcNAcase) Beta-hexosaminidase (O-GlcNAcase) HEXC MEA5 N-acetyl-beta-D-glucosaminidase (O-GlcNAcase) OGA Protein O-GlcNAcase
Type:
Enzyme
Mol. Mass.:
102874.67
Organism:
Homo sapiens (Human)
Description:
O60502
Residue:
916
  
Inhibitor
Name:
BDBM481718
Synonyms:
US10913733, Example 29
Type:
Small organic molecule
Emp. Form.:
C19H21N3O3S
Mol. Mass.:
371.453
SMILES:
[#6]-[#6](=O)-[#7]-c1ncc(-[#6]-[#7]-2-[#6]-[#6]\[#6](-[#6]-[#6]-2)=[#6]\c2ccc(cc2)-[#6](-[#8])=O)s1
: