Target
Protein O-GlcNAcase
Ligand
BDBM481726
Substrate
Meas. Tech.
Assay for Determination of KI Values for Inhibition of O-GlcNAcase Activity
Ki
29.8±n/a nM
Citation
 McEachern, EJSelnick, HGZhou, Y Substituted piperidines thiazolyl acetamides as glycosidase inhibitors and uses thereof US Patent  US10913733 Publication Date 2/9/2021 
Target
Name:
Protein O-GlcNAcase
Synonyms:
2-acetamido-2-deoxy-β-D-glucopyranosidase (O-GlcNAcase) Beta-hexosaminidase (O-GlcNAcase) HEXC MEA5 N-acetyl-beta-D-glucosaminidase (O-GlcNAcase) OGA Protein O-GlcNAcase
Type:
Enzyme
Mol. Mass.:
102874.67
Organism:
Homo sapiens (Human)
Description:
O60502
Residue:
916
  
Inhibitor
Name:
BDBM481726
Synonyms:
(S,E)-N-(5-((4-benzylidene-2- methylpiperidin-1- yl)methyl)thiazol-2- yl)acetamide | US10913733, Example 37
Type:
Small organic molecule
Emp. Form.:
C19H23N3OS
Mol. Mass.:
341.47
SMILES:
C[C@H]1C\C(CCN1Cc1cnc(NC(C)=O)s1)=C\c1ccccc1
: