Target
Tyrosine-protein kinase JAK1
Ligand
BDBM292108
Substrate
Meas. Tech.
LanthaScreen Biochemical Assay
Ki
<0.1±n/a nM
Citation
 Fatheree, PRJacobsen, JRBrandt, GEBenjamin, NDabros, MThalladi, VR JAK kinase inhibitor compounds for treatment of respiratory disease US Patent  US10913740 Publication Date 2/9/2021 
Target
Name:
Tyrosine-protein kinase JAK1
Synonyms:
JAK-1 JAK1A JAK1_HUMAN Janus kinase 1 (JAK1) | Janus kinase 1 JAK1
Type:
Protein
Mol. Mass.:
133293.73
Organism:
Homo sapiens (Human)
Description:
P23458
Residue:
1154
  
Inhibitor
Name:
BDBM292108
Synonyms:
US10100049, Example 5 US10526330, Example 5 US11299492, Example 5 | US11718616, Example 5
Type:
Small organic molecule
Emp. Form.:
C27H29FN6O
Mol. Mass.:
472.5572
SMILES:
CCc1cc(O)c(F)cc1-c1ccc2c(n[nH]c2c1)-c1nc2CN(CCc2[nH]1)C1CN(C1)C1CC1
: